ACCESSION: MSBNK-Fac_Eng_Univ_Tokyo-JP003142
RECORD_TITLE: BENZYL BENZOATE; EI-B; MS
DATE: 2016.01.19 (Created 2008.10.21, modified 2011.05.06)
AUTHORS: NAKAYAMA M, MASS SPECTROSCOPY SOC. OF JAPAN (MSSJ)
LICENSE: CC BY-NC-SA

CH$NAME: BENZYL BENZOATE
CH$COMPOUND_CLASS: N/A
CH$FORMULA: C14H12O2
CH$EXACT_MASS: 212.08373
CH$SMILES: O=C(OCc(c2)cccc2)c(c1)cccc1
CH$IUPAC: InChI=1S/C14H12O2/c15-14(13-9-5-2-6-10-13)16-11-12-7-3-1-4-8-12/h1-10H,11H2
CH$LINK: COMPTOX DTXSID8029153
CH$LINK: INCHIKEY SESFRYSPDFLNCH-UHFFFAOYSA-N
CH$LINK: PUBCHEM CID:2345

AC$INSTRUMENT: HITACHI RMU-7L
AC$INSTRUMENT_TYPE: EI-B
AC$MASS_SPECTROMETRY: MS_TYPE MS
AC$MASS_SPECTROMETRY: ION_MODE POSITIVE
AC$MASS_SPECTROMETRY: IONIZATION_ENERGY 70 eV

MS$FOCUSED_ION: ION_TYPE [M]+*

PK$SPLASH: splash10-0a4i-7920000000-b0cd2b3fa8283d974d76
PK$NUM_PEAK: 11
PK$PEAK: m/z int. rel.int.
  51 11 110
  65 11 110
  77 24 240
  90 7 70
  91 45 450
  105 99.99 999
  106 7 70
  107 7 70
  167 3 30
  194 4 40
  212 27 270