ACCESSION: MSBNK-Fac_Eng_Univ_Tokyo-JP003174
RECORD_TITLE: METHADONE; CI-B; MS
DATE: 2016.01.19 (Created 2008.10.21, modified 2011.05.06)
AUTHORS: YOSHIZUMI H, FAC. OF PHARMACY, MEIJO UNIV.
LICENSE: CC BY-NC-SA

CH$NAME: METHADONE
CH$COMPOUND_CLASS: N/A
CH$FORMULA: C21H27NO
CH$EXACT_MASS: 309.20926
CH$SMILES: CN(C)C(C)CC(C(=O)CC)(c(c2)cccc2)c(c1)cccc1
CH$IUPAC: InChI=1S/C21H27NO/c1-5-20(23)21(16-17(2)22(3)4,18-12-8-6-9-13-18)19-14-10-7-11-15-19/h6-15,17H,5,16H2,1-4H3
CH$LINK: INCHIKEY USSIQXCVUWKGNF-UHFFFAOYSA-N
CH$LINK: COMPTOX DTXSID7023273

AC$INSTRUMENT: Unknown
AC$INSTRUMENT_TYPE: CI-B
AC$MASS_SPECTROMETRY: MS_TYPE MS
AC$MASS_SPECTROMETRY: ION_MODE POSITIVE
AC$MASS_SPECTROMETRY: REAGENT_GAS ISOBUTANE

PK$SPLASH: splash10-03di-0009000000-c583dd769bf5998ac160
PK$NUM_PEAK: 5
PK$PEAK: m/z int. rel.int.
  308 4 40
  309 1 10
  310 99.99 999
  311 24 240
  312 3 30