ACCESSION: MSBNK-Fac_Eng_Univ_Tokyo-JP003194
RECORD_TITLE: ETHYL P-AMINOBENZOATE; EI-B; MS
DATE: 2016.01.19 (Created 2008.10.21, modified 2011.05.06)
AUTHORS: MASS SPECTROSCOPY SOC. OF JAPAN (MSSJ)
LICENSE: CC BY-NC-SA

CH$NAME: ETHYL P-AMINOBENZOATE
CH$COMPOUND_CLASS: N/A
CH$FORMULA: C9H11NO2
CH$EXACT_MASS: 165.07898
CH$SMILES: CCOC(=O)c(c1)ccc(N)c1
CH$IUPAC: InChI=1S/C9H11NO2/c1-2-12-9(11)7-3-5-8(10)6-4-7/h3-6H,2,10H2,1H3
CH$LINK: INCHIKEY BLFLLBZGZJTVJG-UHFFFAOYSA-N
CH$LINK: COMPTOX DTXSID8021804

AC$INSTRUMENT: HITACHI RMU-7
AC$INSTRUMENT_TYPE: EI-B
AC$MASS_SPECTROMETRY: MS_TYPE MS
AC$MASS_SPECTROMETRY: ION_MODE POSITIVE
AC$MASS_SPECTROMETRY: IONIZATION_ENERGY 70 eV

MS$FOCUSED_ION: ION_TYPE [M]+*

PK$SPLASH: splash10-0109-9400000000-8e31c925b871e0f0299e
PK$NUM_PEAK: 25
PK$PEAK: m/z int. rel.int.
  26 12 120
  27 34 340
  28 20 200
  29 30 300
  30 7 70
  37 8 80
  38 10 100
  39 31 310
  40 10 100
  41 14 140
  52 11 110
  62 8 80
  63 19 190
  64 13 130
  65 63 630
  66 12 120
  91 7 70
  92 44 440
  93 9 90
  119 6 60
  120 99.99 999
  121 12 120
  137 20 200
  165 24 240
  166 3 30