ACCESSION: MSBNK-Fac_Eng_Univ_Tokyo-JP003196
RECORD_TITLE: ETHYL P-HYDROXYBENZOATE; EI-B; MS
DATE: 2016.01.19 (Created 2008.10.21, modified 2011.05.06)
AUTHORS: MASS SPECTROSCOPY SOC. OF JAPAN (MSSJ)
LICENSE: CC BY-NC-SA

CH$NAME: ETHYL P-HYDROXYBENZOATE
CH$COMPOUND_CLASS: N/A
CH$FORMULA: C9H10O3
CH$EXACT_MASS: 166.06299
CH$SMILES: CCOC(=O)c(c1)ccc(O)c1
CH$IUPAC: InChI=1S/C9H10O3/c1-2-12-9(11)7-3-5-8(10)6-4-7/h3-6,10H,2H2,1H3
CH$LINK: INCHIKEY NUVBSKCKDOMJSU-UHFFFAOYSA-N
CH$LINK: COMPTOX DTXSID9022528

AC$INSTRUMENT: HITACHI RMU-7
AC$INSTRUMENT_TYPE: EI-B
AC$MASS_SPECTROMETRY: MS_TYPE MS
AC$MASS_SPECTROMETRY: ION_MODE POSITIVE
AC$MASS_SPECTROMETRY: IONIZATION_ENERGY 70 eV

MS$FOCUSED_ION: ION_TYPE [M]+*

PK$SPLASH: splash10-00y0-3900000000-c1ca8c4a3e26621c8959
PK$NUM_PEAK: 10
PK$PEAK: m/z int. rel.int.
  39 20 200
  63 7 70
  65 26 260
  93 28 280
  120 6 60
  121 99.99 999
  122 9 90
  138 35 350
  166 43 430
  167 7 70