ACCESSION: MSBNK-Fac_Eng_Univ_Tokyo-JP003239
RECORD_TITLE: ROTIORIN; EI-B; MS
DATE: 2016.01.19 (Created 2008.10.21, modified 2011.05.06)
AUTHORS: MASS SPECTROSCOPY SOC. OF JAPAN (MSSJ)
LICENSE: CC BY-NC-SA

CH$NAME: ROTIORIN
CH$COMPOUND_CLASS: N/A
CH$FORMULA: C23H24O5
CH$EXACT_MASS: 380.16237
CH$SMILES: N/A
CH$IUPAC: N/A

AC$INSTRUMENT: HITACHI RMU-7
AC$INSTRUMENT_TYPE: EI-B
AC$MASS_SPECTROMETRY: MS_TYPE MS
AC$MASS_SPECTROMETRY: ION_MODE POSITIVE
AC$MASS_SPECTROMETRY: IONIZATION_ENERGY 70 eV

MS$FOCUSED_ION: ION_TYPE [M]+*

PK$SPLASH: splash10-0019-0019000000-4457fe87d98a68a80bac
PK$NUM_PEAK: 12
PK$PEAK: m/z int. rel.int.
  152 8 80
  165 12 120
  281 13 130
  282 20 200
  295 11 110
  297 10 100
  309 7 70
  337 71 710
  338 92 920
  339 20 200
  380 99.99 999
  381 27 270