ACCESSION: MSBNK-Fac_Eng_Univ_Tokyo-JP003369
RECORD_TITLE: ETHOXYCARBONYLMETHYL METHYL PHTHALATE; EI-B; MS
DATE: 2016.01.19 (Created 2008.10.21, modified 2011.05.06)
AUTHORS: KOGA M, UNIV. OF OCCUPATIONAL AND ENVIRONMENTAL HEALTH
LICENSE: CC BY-NC-SA

CH$NAME: ETHOXYCARBONYLMETHYL METHYL PHTHALATE
CH$NAME: METHYL PHTHALYL ETHYL GLYCOLATE
CH$COMPOUND_CLASS: N/A
CH$FORMULA: C13H14O6
CH$EXACT_MASS: 266.07904
CH$SMILES: CCOC(=O)COC(=O)c(c1)c(ccc1)C(=O)OC
CH$IUPAC: InChI=1S/C13H14O6/c1-3-18-11(14)8-19-13(16)10-7-5-4-6-9(10)12(15)17-2/h4-7H,3,8H2,1-2H3
CH$LINK: INCHIKEY OYMDOVKIWFMTAW-UHFFFAOYSA-N

AC$INSTRUMENT: JEOL JMS-01-SG-2
AC$INSTRUMENT_TYPE: EI-B
AC$MASS_SPECTROMETRY: MS_TYPE MS
AC$MASS_SPECTROMETRY: ION_MODE POSITIVE
AC$MASS_SPECTROMETRY: IONIZATION_ENERGY 75 eV

MS$FOCUSED_ION: ION_TYPE [M]+*

PK$SPLASH: splash10-03di-3900000000-abaf2c2bbe281687ea1a
PK$NUM_PEAK: 22
PK$PEAK: m/z int. rel.int.
  45 3 30
  50 8.6 86
  51 2.5 25
  58 2.9 29
  66 2.9 29
  74 2 20
  75 2.7 27
  76 1.43 14
  77 16.6 166
  92 5.5 55
  104 11.3 113
  105 0.4 4
  132 2 20
  133 3 30
  135 5.4 54
  149 1.05 11
  163 99.99 999
  164 10.6 106
  177 2.4 24
  221 0.66 7
  235 7.1 71
  266 7 70