ACCESSION: MSBNK-Fac_Eng_Univ_Tokyo-JP003491
RECORD_TITLE: N-(3-TRIMETHYLSILYLOXYPROPYL)MORPHOLINE; EI-B; MS
DATE: 2016.01.19 (Created 2008.10.21, modified 2011.05.06)
AUTHORS: MASS SPECTROSCOPY SOC. OF JAPAN (MSSJ)
LICENSE: CC BY-NC-SA

CH$NAME: N-(3-TRIMETHYLSILYLOXYPROPYL)MORPHOLINE
CH$COMPOUND_CLASS: N/A
CH$FORMULA: C10H23NO2Si
CH$EXACT_MASS: 217.14981
CH$SMILES: O(C1)CCN(C1)CCCO[Si](C)(C)C
CH$IUPAC: InChI=1S/C10H23NO2Si/c1-14(2,3)13-8-4-5-11-6-9-12-10-7-11/h4-10H2,1-3H3
CH$LINK: INCHIKEY QQPKVMLRAUKZFK-UHFFFAOYSA-N

AC$INSTRUMENT: HITACHI M-60
AC$INSTRUMENT_TYPE: EI-B
AC$MASS_SPECTROMETRY: MS_TYPE MS
AC$MASS_SPECTROMETRY: ION_MODE POSITIVE
AC$MASS_SPECTROMETRY: IONIZATION_ENERGY 20 eV

MS$FOCUSED_ION: ION_TYPE [M]+*

PK$SPLASH: splash10-0udi-8900000000-f08287008efe1d86e0ba
PK$NUM_PEAK: 37
PK$PEAK: m/z int. rel.int.
  41 6.2 62
  42 10.82 108
  43 15.78 158
  44 3.12 31
  45 6.14 61
  47 1.14 11
  55 2.81 28
  56 12.33 123
  57 3.41 34
  58 2.35 24
  59 5.93 59
  69 2.8 28
  70 3.29 33
  71 3.81 38
  72 1.58 16
  73 15.83 158
  74 0.8 8
  75 7.47 75
  84 1.8 18
  86 5.71 57
  87 0.59 6
  89 0.78 8
  98 1.25 13
  100 99.99 999
  101 10.47 105
  102 0.65 7
  103 1.77 18
  115 1.57 16
  116 0.42 4
  129 0.41 4
  144 0.75 8
  145 3.88 39
  158 0.36 4
  171 0.6 6
  186 1.23 12
  202 2.43 24
  217 1.09 11