ACCESSION: MSBNK-Fac_Eng_Univ_Tokyo-JP003575
RECORD_TITLE: TEREPHTHALOYL BIS(2,6-DI-METHYL-4-TERT-BUTYL-3-HYDROXY-BENZYL SULFIDE); EI-B; MS
DATE: 2016.01.19 (Created 2008.10.21, modified 2011.05.06)
AUTHORS: MASS SPECTROSCOPY SOC. OF JAPAN (MSSJ)
LICENSE: CC BY-NC-SA

CH$NAME: TEREPHTHALOYL BIS(2,6-DI-METHYL-4-TERT-BUTYL-3-HYDROXY-BENZYL SULFIDE)
CH$COMPOUND_CLASS: N/A
CH$FORMULA: C34H42O4S2
CH$EXACT_MASS: 578.25245
CH$SMILES: N/A
CH$IUPAC: N/A

AC$INSTRUMENT: Unknown
AC$INSTRUMENT_TYPE: EI-B
AC$MASS_SPECTROMETRY: MS_TYPE MS
AC$MASS_SPECTROMETRY: ION_MODE POSITIVE

MS$FOCUSED_ION: ION_TYPE [M]+*

PK$SPLASH: splash10-0006-1900000000-e90b7b34ded52cf820ab
PK$NUM_PEAK: 27
PK$PEAK: m/z int. rel.int.
  41 2.78 28
  43 4.45 45
  55 3.81 38
  57 4.17 42
  69 5.4 54
  91 5.71 57
  92 2.74 27
  104 4.38 44
  105 3.4 34
  121 4.11 41
  135 11.52 115
  136 3.39 34
  137 3.54 35
  149 9.14 91
  161 4.37 44
  163 3.09 31
  165 2.21 22
  175 7.78 78
  176 4.91 49
  177 2.83 28
  189 3.14 31
  190 48.78 488
  191 99.99 999
  192 13.05 131
  355 3.17 32
  578 6.08 61
  579 2.21 22