ACCESSION: MSBNK-Fac_Eng_Univ_Tokyo-JP003608
RECORD_TITLE: N-(3-AMINOPROPYL)CYCLOHEXYLAMINE; EI-B; MS
DATE: 2016.01.19 (Created 2008.10.21, modified 2011.05.06)
AUTHORS: MASS SPECTROSCOPY SOC. OF JAPAN (MSSJ)
LICENSE: CC BY-NC-SA

CH$NAME: N-(3-AMINOPROPYL)CYCLOHEXYLAMINE
CH$COMPOUND_CLASS: N/A
CH$FORMULA: C9H20N2
CH$EXACT_MASS: 156.16265
CH$SMILES: NCCCNC(C1)CCCC1
CH$IUPAC: InChI=1S/C9H20N2/c10-7-4-8-11-9-5-2-1-3-6-9/h9,11H,1-8,10H2
CH$LINK: INCHIKEY ITZPOSYADVYECJ-UHFFFAOYSA-N
CH$LINK: COMPTOX DTXSID6062969

AC$INSTRUMENT: Unknown
AC$INSTRUMENT_TYPE: EI-B
AC$MASS_SPECTROMETRY: MS_TYPE MS
AC$MASS_SPECTROMETRY: ION_MODE POSITIVE

MS$FOCUSED_ION: ION_TYPE [M]+*

PK$SPLASH: splash10-05al-9000000000-d81ae755687cc404d48f
PK$NUM_PEAK: 9
PK$PEAK: m/z int. rel.int.
  30 99.99 999
  41 33.3 333
  44 43.9 439
  55 2.93 29
  56 50 500
  57 34.4 344
  70 90.3 903
  98 5.11 51
  156 3 30