ACCESSION: MSBNK-Fac_Eng_Univ_Tokyo-JP003624
RECORD_TITLE: 1,2,3,4-TETRACHLOROBENZENE; EI-B; MS
DATE: 2016.01.19 (Created 2008.10.21, modified 2011.05.06)
AUTHORS: MASS SPECTROSCOPY SOC. OF JAPAN (MSSJ)
LICENSE: CC BY-NC-SA

CH$NAME: 1,2,3,4-TETRACHLOROBENZENE
CH$COMPOUND_CLASS: N/A
CH$FORMULA: C6H2Cl4
CH$EXACT_MASS: 213.89106
CH$SMILES: Clc(c1)c(Cl)c(Cl)c(Cl)c1
CH$IUPAC: InChI=1S/C6H2Cl4/c7-3-1-2-4(8)6(10)5(3)9/h1-2H
CH$LINK: INCHIKEY GBDZXPJXOMHESU-UHFFFAOYSA-N
CH$LINK: COMPTOX DTXSID6026088

AC$INSTRUMENT: Unknown
AC$INSTRUMENT_TYPE: EI-B
AC$MASS_SPECTROMETRY: MS_TYPE MS
AC$MASS_SPECTROMETRY: ION_MODE POSITIVE

MS$FOCUSED_ION: ION_TYPE [M]+*

PK$SPLASH: splash10-014i-1390000000-31ac92a1eb29d88ba74c
PK$NUM_PEAK: 26
PK$PEAK: m/z int. rel.int.
  28 2.1 21
  72 2.5 25
  73 4 40
  74 0.62 6
  84 4 40
  89 2 20
  90 1.9 19
  107 0.57 6
  108 11.5 115
  109 9.2 92
  110 2 20
  143 0.83 8
  144 4 40
  145 5 50
  146 2 20
  179 1.61 16
  180 2 20
  181 14.2 142
  183 5 50
  214 7.89 79
  215 5.2 52
  216 99.99 999
  217 7 70
  218 4.85 49
  219 3 30
  220 10 100