ACCESSION: MSBNK-Fac_Eng_Univ_Tokyo-JP003626
RECORD_TITLE: 1,2,4,5-TETRACHLOROBENZENE; EI-B; MS
DATE: 2016.01.19 (Created 2008.10.21, modified 2011.05.06)
AUTHORS: MASS SPECTROSCOPY SOC. OF JAPAN (MSSJ)
LICENSE: CC BY-NC-SA

CH$NAME: 1,2,4,5-TETRACHLOROBENZENE
CH$COMPOUND_CLASS: N/A
CH$FORMULA: C6H2Cl4
CH$EXACT_MASS: 213.89106
CH$SMILES: Clc(c1)c(Cl)cc(Cl)c(Cl)1
CH$IUPAC: InChI=1S/C6H2Cl4/c7-3-1-4(8)6(10)2-5(3)9/h1-2H
CH$LINK: INCHIKEY JHBKHLUZVFWLAG-UHFFFAOYSA-N
CH$LINK: COMPTOX DTXSID7024320

AC$INSTRUMENT: Unknown
AC$INSTRUMENT_TYPE: EI-B
AC$MASS_SPECTROMETRY: MS_TYPE MS
AC$MASS_SPECTROMETRY: ION_MODE POSITIVE

MS$FOCUSED_ION: ION_TYPE [M]+*

PK$SPLASH: splash10-01t9-6390000000-0003b90da1a30c13e26a
PK$NUM_PEAK: 24
PK$PEAK: m/z int. rel.int.
  79 99.99 999
  80 3 30
  84 4 40
  89 0.25 3
  90 2.3 23
  107 5.7 57
  108 11.8 118
  109 0.89 9
  110 3 30
  143 8 80
  144 3.5 35
  145 0.6 6
  146 2.8 28
  179 13.1 131
  180 2.8 28
  181 1.32 13
  183 4 40
  214 69.5 695
  215 5.6 56
  216 8.9 89
  217 6 60
  218 42.3 423
  219 3 30
  220 9.2 92