ACCESSION: MSBNK-Fac_Eng_Univ_Tokyo-JP003667
RECORD_TITLE: 1,2,3,4,7,7-HEXAFLUOROBICYCLO(2.2.1)HEPTA-2,5-DIENE; EI-B; MS
DATE: 2016.01.19 (Created 2008.10.21, modified 2011.05.06)
AUTHORS: SASAKI S, TOYOHASHI UNIV. OF TECH.
LICENSE: CC BY-NC-SA

CH$NAME: 1,2,3,4,7,7-HEXAFLUOROBICYCLO(2.2.1)HEPTA-2,5-DIENE
CH$COMPOUND_CLASS: N/A
CH$FORMULA: C7H2F6
CH$EXACT_MASS: 200.00607
CH$SMILES: [H]C(=C([H])1)C(F)(C(F)=2)C(F)(F)C(F)1C(F)2
CH$IUPAC: InChI=1S/C7H2F6/c8-3-4(9)6(11)2-1-5(3,10)7(6,12)13/h1-2H
CH$LINK: INCHIKEY BFEDHPALJLSLEE-UHFFFAOYSA-N
CH$LINK: COMPTOX DTXSID00513443

AC$INSTRUMENT: Unknown
AC$INSTRUMENT_TYPE: EI-B
AC$MASS_SPECTROMETRY: MS_TYPE MS
AC$MASS_SPECTROMETRY: ION_MODE POSITIVE

MS$FOCUSED_ION: ION_TYPE [M]+*

PK$SPLASH: splash10-0ue9-5920000000-d35ed5e29d8bec5c37ef
PK$NUM_PEAK: 10
PK$PEAK: m/z int. rel.int.
  69 50 500
  74 25 250
  81 43 430
  93 5 50
  124 30 300
  131 18 180
  150 99.99 999
  174 0.3 3
  181 60 600
  200 65 650