ACCESSION: MSBNK-Fac_Eng_Univ_Tokyo-JP003705
RECORD_TITLE: ETHYL METHYL ETHER; EI-B; MS
DATE: 2016.01.19 (Created 2008.10.21, modified 2011.05.06)
AUTHORS: SASAKI S, TOYOHASHI UNIV. OF TECH.
LICENSE: CC BY-NC-SA

CH$NAME: ETHYL METHYL ETHER
CH$COMPOUND_CLASS: N/A
CH$FORMULA: C3H8O
CH$EXACT_MASS: 60.05751
CH$SMILES: CCOC
CH$IUPAC: InChI=1S/C3H8O/c1-3-4-2/h3H2,1-2H3
CH$LINK: INCHIKEY XOBKSJJDNFUZPF-UHFFFAOYSA-N
CH$LINK: COMPTOX DTXSID5074557

AC$INSTRUMENT: Unknown
AC$INSTRUMENT_TYPE: EI-B
AC$MASS_SPECTROMETRY: MS_TYPE MS
AC$MASS_SPECTROMETRY: ION_MODE POSITIVE

MS$FOCUSED_ION: ION_TYPE [M]+*

PK$SPLASH: splash10-002b-9000000000-67b43ea07cd0aa7f2f76
PK$NUM_PEAK: 16
PK$PEAK: m/z int. rel.int.
  15 20.7 207
  26 8.8 88
  27 20.5 205
  28 0.78 8
  29 49 490
  30 3.4 34
  31 19.9 199
  32 0.21 2
  41 0.8 8
  42 1.6 16
  43 7 70
  44 0.08 1
  45 99.99 999
  46 1.6 16
  59 10.9 109
  60 25.9 259