ACCESSION: MSBNK-Fac_Eng_Univ_Tokyo-JP003720
RECORD_TITLE: O-PENTYLHYDROXYLAMINE; EI-B; MS
DATE: 2016.01.19 (Created 2008.10.21, modified 2011.05.06)
AUTHORS: SASAKI S, TOYOHASHI UNIV. OF TECH.
LICENSE: CC BY-NC-SA

CH$NAME: O-PENTYLHYDROXYLAMINE
CH$COMPOUND_CLASS: N/A
CH$FORMULA: C5H13NO
CH$EXACT_MASS: 103.09971
CH$SMILES: CCCCCON
CH$IUPAC: InChI=1S/C5H13NO/c1-2-3-4-5-7-6/h2-6H2,1H3
CH$LINK: INCHIKEY VBPVZDFRUFVPDV-UHFFFAOYSA-N
CH$LINK: COMPTOX DTXSID20531588

AC$INSTRUMENT: Unknown
AC$INSTRUMENT_TYPE: EI-B
AC$MASS_SPECTROMETRY: MS_TYPE MS
AC$MASS_SPECTROMETRY: ION_MODE POSITIVE

MS$FOCUSED_ION: ION_TYPE [M]+*

PK$SPLASH: splash10-0006-9000000000-a00e64053f476eb6d7dc
PK$NUM_PEAK: 19
PK$PEAK: m/z int. rel.int.
  38 16.4 164
  39 11.7 117
  41 39.1 391
  42 2.97 30
  43 99.99 999
  44 19.5 195
  45 3.9 39
  46 0.39 4
  53 2.3 23
  55 27.3 273
  56 5.9 59
  57 0.59 6
  58 7 70
  69 2.3 23
  70 19.5 195
  71 0.25 3
  72 1.6 16
  86 0.8 8
  103 1.2 12