ACCESSION: MSBNK-Fac_Eng_Univ_Tokyo-JP003732
RECORD_TITLE: O-ISOPENTYLHYDROXYLAMINE; EI-B; MS
DATE: 2016.01.19 (Created 2008.10.21, modified 2011.05.06)
AUTHORS: SASAKI S, TOYOHASHI UNIV. OF TECH.
LICENSE: CC BY-NC-SA

CH$NAME: O-ISOPENTYLHYDROXYLAMINE
CH$COMPOUND_CLASS: N/A
CH$FORMULA: C5H13NO
CH$EXACT_MASS: 103.09971
CH$SMILES: NOCCC(C)C
CH$IUPAC: InChI=1S/C5H13NO/c1-5(2)3-4-7-6/h5H,3-4,6H2,1-2H3
CH$LINK: INCHIKEY PXWPXXJVCQOIPH-UHFFFAOYSA-N
CH$LINK: COMPTOX DTXSID60336812

AC$INSTRUMENT: Unknown
AC$INSTRUMENT_TYPE: EI-B
AC$MASS_SPECTROMETRY: MS_TYPE MS
AC$MASS_SPECTROMETRY: ION_MODE POSITIVE

MS$FOCUSED_ION: ION_TYPE [M]+*

PK$SPLASH: splash10-0006-9000000000-196ecf28153e47712035
PK$NUM_PEAK: 19
PK$PEAK: m/z int. rel.int.
  39 14.2 142
  40 3.4 34
  41 33.3 333
  42 1.5 15
  43 99.99 999
  44 7.5 75
  45 3.4 34
  46 0.58 6
  53 2.4 24
  54 0.8 8
  55 20 200
  56 0.83 8
  57 5.8 58
  58 5.8 58
  69 1.7 17
  70 0.1 1
  71 25 250
  72 1.7 17
  103 0.9 9