ACCESSION: MSBNK-Fac_Eng_Univ_Tokyo-JP003846
RECORD_TITLE: ALPHA-METHYL-BENZENEETHANAMINE; EI-B; MS
DATE: 2016.01.19 (Created 2008.10.21, modified 2011.05.06)
AUTHORS: SASAKI S, TOYOHASHI UNIV. OF TECH.
LICENSE: CC BY-NC-SA

CH$NAME: ALPHA-METHYL-BENZENEETHANAMINE
CH$NAME: AMPHETAMINE
CH$COMPOUND_CLASS: N/A
CH$FORMULA: C9H13N
CH$EXACT_MASS: 135.1048
CH$SMILES: N/A
CH$IUPAC: N/A

AC$INSTRUMENT: Unknown
AC$INSTRUMENT_TYPE: EI-B
AC$MASS_SPECTROMETRY: MS_TYPE MS
AC$MASS_SPECTROMETRY: ION_MODE POSITIVE
AC$MASS_SPECTROMETRY: IONIZATION_ENERGY 70 eV

MS$FOCUSED_ION: ION_TYPE [M]+*

PK$SPLASH: splash10-0006-9000000000-3edad3a2479c023682c6
PK$NUM_PEAK: 27
PK$PEAK: m/z int. rel.int.
  40 2.9 29
  41 1.4 14
  42 3.9 39
  43 0.19 2
  44 99.99 999
  45 3.9 39
  51 2.4 24
  59 0.04 0
  60 1.4 14
  62 0.9 9
  63 2.4 24
  64 0.04 0
  65 4.9 49
  77 1.9 19
  89 1.4 14
  90 0.19 2
  91 8.9 89
  92 2.9 29
  103 1.4 14
  104 0.09 1
  115 1.9 19
  116 0.9 9
  117 1.4 14
  118 0.09 1
  119 0.9 9
  120 3.4 34
  135 0.4 4