ACCESSION: MSBNK-Fac_Eng_Univ_Tokyo-JP003891
RECORD_TITLE: OXALIC ACID; EI-B; MS
DATE: 2016.01.19 (Created 2008.10.21, modified 2011.05.06)
AUTHORS: MASS SPECTROSCOPY SOC. OF JAPAN (MSSJ)
LICENSE: CC BY-NC-SA

CH$NAME: OXALIC ACID
CH$COMPOUND_CLASS: N/A
CH$FORMULA: C2H2O4
CH$EXACT_MASS: 89.99531
CH$SMILES: OC(=O)C(O)=O
CH$IUPAC: InChI=1S/C2H2O4/c3-1(4)2(5)6/h(H,3,4)(H,5,6)
CH$LINK: INCHIKEY MUBZPKHOEPUJKR-UHFFFAOYSA-N
CH$LINK: COMPTOX DTXSID0025816

AC$INSTRUMENT: Unknown
AC$INSTRUMENT_TYPE: EI-B
AC$MASS_SPECTROMETRY: MS_TYPE MS
AC$MASS_SPECTROMETRY: ION_MODE POSITIVE

MS$FOCUSED_ION: ION_TYPE [M]+*

PK$SPLASH: splash10-0006-9000000000-8aef9a64d926571c2de0
PK$NUM_PEAK: 9
PK$PEAK: m/z int. rel.int.
  12 2.2 22
  16 4.2 42
  17 12.8 128
  18 5.75 58
  28 9.7 97
  36 2.1 21
  44 99.99 999
  45 0.41 4
  46 4.8 48