ACCESSION: MSBNK-Fac_Eng_Univ_Tokyo-JP003909
RECORD_TITLE: ETHYL ISOBUTYL ETHER; EI-B; MS
DATE: 2016.01.19 (Created 2008.10.21, modified 2011.05.06)
AUTHORS: MASS SPECTROSCOPY SOC. OF JAPAN (MSSJ)
LICENSE: CC BY-NC-SA

CH$NAME: ETHYL ISOBUTYL ETHER
CH$COMPOUND_CLASS: N/A
CH$FORMULA: C6H14O
CH$EXACT_MASS: 102.10447
CH$SMILES: CCOCC(C)C
CH$IUPAC: InChI=1S/C6H14O/c1-4-7-5-6(2)3/h6H,4-5H2,1-3H3
CH$LINK: COMPTOX DTXSID4074934
CH$LINK: INCHIKEY RQUBQBFVDOLUKC-UHFFFAOYSA-N
CH$LINK: PUBCHEM CID:69386

AC$INSTRUMENT: Unknown
AC$INSTRUMENT_TYPE: EI-B
AC$MASS_SPECTROMETRY: MS_TYPE MS
AC$MASS_SPECTROMETRY: ION_MODE POSITIVE

MS$FOCUSED_ION: ION_TYPE [M]+*

PK$SPLASH: splash10-0a4i-9000000000-d1ff3ce7e26763cd6faa
PK$NUM_PEAK: 26
PK$PEAK: m/z int. rel.int.
  14 2.9 29
  15 12.1 121
  26 4.6 46
  27 2.92 29
  28 6.5 65
  29 43.2 432
  30 3.6 36
  31 7.63 76
  33 3.4 34
  38 2.8 28
  39 14 140
  40 0.32 3
  41 27.3 273
  42 6.9 69
  44 16.6 166
  45 0.55 6
  55 4.5 45
  56 4.5 45
  57 13.5 135
  58 0.42 4
  59 99.99 999
  60 3.5 35
  61 2.5 25
  73 0.8 8
  78 3 30
  102 7.1 71