ACCESSION: MSBNK-Fac_Eng_Univ_Tokyo-JP003911
RECORD_TITLE: ETHYL TERT-BUTYL ETHER; EI-B; MS
DATE: 2016.01.19 (Created 2008.10.21, modified 2011.05.06)
AUTHORS: MASS SPECTROSCOPY SOC. OF JAPAN (MSSJ)
LICENSE: CC BY-NC-SA

CH$NAME: ETHYL TERT-BUTYL ETHER
CH$COMPOUND_CLASS: N/A
CH$FORMULA: C6H14O
CH$EXACT_MASS: 102.10447
CH$SMILES: CCOC(C)(C)C
CH$IUPAC: InChI=1S/C6H14O/c1-5-7-6(2,3)4/h5H2,1-4H3
CH$LINK: INCHIKEY NUMQCACRALPSHD-UHFFFAOYSA-N
CH$LINK: COMPTOX DTXSID0025604

AC$INSTRUMENT: Unknown
AC$INSTRUMENT_TYPE: EI-B
AC$MASS_SPECTROMETRY: MS_TYPE MS
AC$MASS_SPECTROMETRY: ION_MODE POSITIVE

MS$FOCUSED_ION: ION_TYPE [M]+*

PK$SPLASH: splash10-0a4i-9000000000-375f2f17a667272bf9f4
PK$NUM_PEAK: 8
PK$PEAK: m/z int. rel.int.
  15 7.9 79
  27 11.6 116
  29 20.4 204
  41 1.98 20
  43 11.6 116
  57 36.5 365
  59 99.99 999
  87 38.5 385