ACCESSION: MSBNK-Fac_Eng_Univ_Tokyo-JP003926
RECORD_TITLE: PYRIDINE; EI-B; MS
DATE: 2016.01.19 (Created 2008.10.21, modified 2011.05.06)
AUTHORS: MASS SPECTROSCOPY SOC. OF JAPAN (MSSJ)
LICENSE: CC BY-NC-SA

CH$NAME: PYRIDINE
CH$COMPOUND_CLASS: N/A
CH$FORMULA: C5H5N
CH$EXACT_MASS: 79.04220
CH$SMILES: c(c1)ccnc1
CH$IUPAC: InChI=1S/C5H5N/c1-2-4-6-5-3-1/h1-5H
CH$LINK: INCHIKEY JUJWROOIHBZHMG-UHFFFAOYSA-N
CH$LINK: COMPTOX DTXSID9021924

AC$INSTRUMENT: Unknown
AC$INSTRUMENT_TYPE: EI-B
AC$MASS_SPECTROMETRY: MS_TYPE MS
AC$MASS_SPECTROMETRY: ION_MODE POSITIVE

MS$FOCUSED_ION: ION_TYPE [M]+*

PK$SPLASH: splash10-0fb9-9000000000-f99a956b2e7b0837d371
PK$NUM_PEAK: 19
PK$PEAK: m/z int. rel.int.
  1 2.6 26
  25 2.9 29
  26 22.3 223
  27 0.66 7
  28 5.7 57
  37 4.8 48
  38 5.5 55
  39 1.19 12
  40 2.9 29
  49 5.6 56
  50 34.7 347
  51 4.3 43
  52 73.8 738
  53 10.2 102
  75 3.2 32
  76 0.2 2
  78 7.5 75
  79 99.99 999
  80 6.1 61