ACCESSION: MSBNK-Fac_Eng_Univ_Tokyo-JP004030
RECORD_TITLE: ETHYL 1-PHENYLETHYL ETHER; EI-B; MS
DATE: 2016.01.19 (Created 2008.10.21, modified 2011.05.06)
AUTHORS: MASS SPECTROSCOPY SOC. OF JAPAN (MSSJ)
LICENSE: CC BY-NC-SA

CH$NAME: ETHYL 1-PHENYLETHYL ETHER
CH$COMPOUND_CLASS: N/A
CH$FORMULA: C10H14O
CH$EXACT_MASS: 150.10447
CH$SMILES: CCOC(C)c(c1)cccc1
CH$IUPAC: InChI=1S/C10H14O/c1-3-11-9(2)10-7-5-4-6-8-10/h4-9H,3H2,1-2H3
CH$LINK: INCHIKEY MVTKJCAAJPVUHJ-UHFFFAOYSA-N

AC$INSTRUMENT: HITACHI RMU-6L
AC$INSTRUMENT_TYPE: EI-B
AC$MASS_SPECTROMETRY: MS_TYPE MS
AC$MASS_SPECTROMETRY: ION_MODE POSITIVE
AC$MASS_SPECTROMETRY: IONIZATION_ENERGY 70 eV

MS$FOCUSED_ION: ION_TYPE [M]+*

PK$SPLASH: splash10-0a70-6900000000-9a6b1c19be1de34a9db3
PK$NUM_PEAK: 43
PK$PEAK: m/z int. rel.int.
  15 2.9 29
  18 3.5 35
  27 6.1 61
  28 0.32 3
  29 6.4 64
  31 2.1 21
  38 1.6 16
  39 0.52 5
  43 28.6 286
  44 1 10
  45 10 100
  50 0.6 6
  51 19.1 191
  52 3 30
  53 1.1 11
  60 0.11 1
  62 1 10
  63 3 30
  65 1.5 15
  71 0.1 1
  73 2.3 23
  74 2.2 22
  76 2 20
  77 5.31 53
  78 10.5 105
  79 47.2 472
  80 3 30
  89 0.2 2
  91 6.7 67
  94 2.1 21
  102 1.1 11
  103 0.9 9
  104 6 60
  105 99.5 995
  106 13.7 137
  107 7.12 71
  108 5.1 51
  120 11 110
  121 3.1 31
  122 0.31 3
  135 99.99 999
  136 9.8 98
  150 2.5 25