ACCESSION: MSBNK-Fac_Eng_Univ_Tokyo-JP004289
RECORD_TITLE: ETHYL BROMIDE; EI-B; MS
DATE: 2016.01.19 (Created 2008.10.21, modified 2011.05.06)
AUTHORS: TAJIMA S, GUNMA COLLEGE OF TECHNOLOGY
LICENSE: CC BY-NC-SA

CH$NAME: ETHYL BROMIDE
CH$NAME: BROMOETHANE
CH$COMPOUND_CLASS: N/A
CH$FORMULA: C2H5Br
CH$EXACT_MASS: 107.95746
CH$SMILES: CCBr
CH$IUPAC: InChI=1S/C2H5Br/c1-2-3/h2H2,1H3
CH$LINK: CAS 74-96-4
CH$LINK: INCHIKEY RDHPKYGYEGBMSE-UHFFFAOYSA-N
CH$LINK: COMPTOX DTXSID6020199

AC$INSTRUMENT: HITACHI RMU-7M
AC$INSTRUMENT_TYPE: EI-B
AC$MASS_SPECTROMETRY: MS_TYPE MS
AC$MASS_SPECTROMETRY: ION_MODE POSITIVE
AC$MASS_SPECTROMETRY: IONIZATION_ENERGY 70 eV

MS$FOCUSED_ION: ION_TYPE [M]+*

PK$SPLASH: splash10-004i-9600000000-4689a003ccba83a948a1
PK$NUM_PEAK: 16
PK$PEAK: m/z int. rel.int.
  25 2.12 21
  26 19.09 191
  27 75.25 753
  28 28.08 281
  29 99.99 999
  30 2.02 20
  77 3.03 30
  79 2.22 22
  81 2.12 21
  93 4.14 41
  95 2.93 29
  105 6.06 61
  108 91.31 913
  109 1.92 19
  110 86.67 867
  111 1.01 10