ACCESSION: MSBNK-Fac_Eng_Univ_Tokyo-JP004701
RECORD_TITLE: ETHYLDIFLUORO(2,4,6-TRI-TERT-BUTYLPHENYL)SILANE; EI-B; MS
DATE: 2016.01.19 (Created 2008.10.21, modified 2011.05.06)
AUTHORS: MASS SPECTROSCOPY SOC. OF JAPAN (MSSJ)
LICENSE: CC BY-NC-SA

CH$NAME: ETHYLDIFLUORO(2,4,6-TRI-TERT-BUTYLPHENYL)SILANE
CH$NAME: 1,3,5-TRI-TERT-BUTYL-2-(ETHYLDIFLUOROSILYL)BENZENE
CH$COMPOUND_CLASS: N/A
CH$FORMULA: C20H34F2Si
CH$EXACT_MASS: 340.23978
CH$SMILES: CC[Si](F)(F)c(c1C(C)(C)C)c(cc(C(C)(C)C)c1)C(C)(C)C
CH$IUPAC: InChI=1S/C20H34F2Si/c1-11-23(21,22)17-15(19(5,6)7)12-14(18(2,3)4)13-16(17)20(8,9)10/h12-13H,11H2,1-10H3
CH$LINK: INCHIKEY QCSVJWLHWUAGLU-UHFFFAOYSA-N

AC$INSTRUMENT: JEOL JMS-D-3000
AC$INSTRUMENT_TYPE: EI-B
AC$MASS_SPECTROMETRY: MS_TYPE MS
AC$MASS_SPECTROMETRY: ION_MODE POSITIVE
AC$MASS_SPECTROMETRY: IONIZATION_ENERGY 70 eV

MS$FOCUSED_ION: ION_TYPE [M]+*

PK$SPLASH: splash10-066r-4090000000-1b2dc8c38ef7051d1217
PK$NUM_PEAK: 27
PK$PEAK: m/z int. rel.int.
  43 1.63 16
  55 2.59 26
  57 57.92 579
  58 2.75 28
  67 1.38 14
  77 1.21 12
  91 2.39 24
  95 3.57 36
  105 1.25 13
  115 1.66 17
  117 1.39 14
  128 1.6 16
  129 1.76 18
  131 1.68 17
  141 1.18 12
  142 1 10
  143 1.44 14
  173 1.12 11
  189 1.08 11
  241 1.17 12
  269 99.99 999
  270 22.5 225
  271 5.85 59
  284 7.53 75
  285 1.03 10
  325 1.46 15
  340 2.39 24