ACCESSION: MSBNK-Fac_Eng_Univ_Tokyo-JP004798
RECORD_TITLE: 1,1-DIETHYL-1,2,2-TRIMETHYLDISILANE; EI-B; MS
DATE: 2016.01.19 (Created 2008.10.21, modified 2011.05.06)
AUTHORS: MASS SPECTROSCOPY SOC. OF JAPAN (MSSJ)
LICENSE: CC BY-NC-SA

CH$NAME: 1,1-DIETHYL-1,2,2-TRIMETHYLDISILANE
CH$COMPOUND_CLASS: N/A
CH$FORMULA: C7H20Si2
CH$EXACT_MASS: 160.11035
CH$SMILES: CC[Si](C)(CC)[SiH](C)C
CH$IUPAC: InChI=1S/C7H20Si2/c1-6-9(5,7-2)8(3)4/h8H,6-7H2,1-5H3
CH$LINK: INCHIKEY KPISIPFWLMPWOU-UHFFFAOYSA-N
CH$LINK: COMPTOX DTXSID50784409

AC$INSTRUMENT: JEOL JMS-D-3000
AC$INSTRUMENT_TYPE: EI-B
AC$MASS_SPECTROMETRY: MS_TYPE MS
AC$MASS_SPECTROMETRY: ION_MODE POSITIVE
AC$MASS_SPECTROMETRY: IONIZATION_ENERGY 70 eV

MS$FOCUSED_ION: ION_TYPE [M]+*

PK$SPLASH: splash10-0uk9-7900000000-82858b4839c5d9738d69
PK$NUM_PEAK: 37
PK$PEAK: m/z int. rel.int.
  43 7.45 75
  44 2.08 21
  45 15.1 151
  55 1.31 13
  57 1.67 17
  58 1.67 17
  59 17.04 170
  60 1.31 13
  69 1.34 13
  71 5.77 58
  72 5.29 53
  73 99.16 992
  74 9.02 90
  75 3.79 38
  85 2.85 29
  86 1.71 17
  87 3.57 36
  88 3 30
  89 8.09 81
  90 1.13 11
  100 3.69 37
  101 99.99 999
  102 11.96 120
  103 41.79 418
  104 5.69 57
  105 2.9 29
  115 1.13 11
  116 1.94 19
  117 8.05 81
  118 1.24 12
  131 9.06 91
  132 1.45 15
  144 2.23 22
  145 4.58 46
  160 19.53 195
  161 3.52 35
  162 1.64 16