ACCESSION: MSBNK-Fac_Eng_Univ_Tokyo-JP004910
RECORD_TITLE: 1,2-DICHLOROETHANE; EI-B; MS
DATE: 2016.01.19 (Created 2008.10.21, modified 2011.05.06)
AUTHORS: MASS SPECTROSCOPY SOC. OF JAPAN (MSSJ)
LICENSE: CC BY-NC-SA

CH$NAME: 1,2-DICHLOROETHANE
CH$COMPOUND_CLASS: N/A
CH$FORMULA: C2H4Cl2
CH$EXACT_MASS: 97.96901
CH$SMILES: ClCCCl
CH$IUPAC: InChI=1S/C2H4Cl2/c3-1-2-4/h1-2H2
CH$LINK: CAS 107-06-2
CH$LINK: INCHIKEY WSLDOOZREJYCGB-UHFFFAOYSA-N
CH$LINK: COMPTOX DTXSID6020438

AC$INSTRUMENT: JEOL JMS-D-3000
AC$INSTRUMENT_TYPE: EI-B
AC$MASS_SPECTROMETRY: MS_TYPE MS
AC$MASS_SPECTROMETRY: ION_MODE POSITIVE
AC$MASS_SPECTROMETRY: IONIZATION_ENERGY 70 eV

MS$FOCUSED_ION: ION_TYPE [M]+*

PK$SPLASH: splash10-03dj-9000000000-cbc052552f77ec2f97a6
PK$NUM_PEAK: 27
PK$PEAK: m/z int. rel.int.
  42 5.07 51
  43 61.22 612
  44 2.84 28
  45 30.04 300
  46 1.6 16
  47 1.95 20
  48 3.15 32
  49 62.65 627
  50 1.85 19
  51 21.22 212
  57 1.22 12
  58 27.89 279
  59 41.91 419
  60 4.44 44
  61 20.8 208
  62 99.99 999
  63 35.38 354
  64 34.84 348
  65 10.12 101
  73 2.29 23
  74 24.98 250
  75 1.26 13
  97 1.36 14
  98 29.28 293
  99 1.34 13
  100 19.09 191
  102 3.11 31