ACCESSION: MSBNK-Fac_Eng_Univ_Tokyo-JP004938
RECORD_TITLE: ETHYL ACRYLATE; EI-B; MS
DATE: 2016.01.19 (Created 2008.10.21, modified 2011.05.06)
AUTHORS: MASS SPECTROSCOPY SOC. OF JAPAN (MSSJ)
LICENSE: CC BY-NC-SA

CH$NAME: ETHYL ACRYLATE
CH$COMPOUND_CLASS: N/A
CH$FORMULA: C5H8O2
CH$EXACT_MASS: 100.05243
CH$SMILES: CCOC(=O)C=C
CH$IUPAC: InChI=1S/C5H8O2/c1-3-5(6)7-4-2/h3H,1,4H2,2H3
CH$LINK: CAS 140-88-5
CH$LINK: INCHIKEY JIGUQPWFLRLWPJ-UHFFFAOYSA-N
CH$LINK: COMPTOX DTXSID4020583

AC$INSTRUMENT: JEOL JMS-D-3000
AC$INSTRUMENT_TYPE: EI-B
AC$MASS_SPECTROMETRY: MS_TYPE MS
AC$MASS_SPECTROMETRY: ION_MODE POSITIVE
AC$MASS_SPECTROMETRY: IONIZATION_ENERGY 70 eV

MS$FOCUSED_ION: ION_TYPE [M]+*

PK$SPLASH: splash10-0a4i-9000000000-9fb2ce6a8c6e827cca22
PK$NUM_PEAK: 15
PK$PEAK: m/z int. rel.int.
  43 9.19 92
  44 1.31 13
  45 10.83 108
  53 1.23 12
  54 4.43 44
  55 99.99 999
  56 13.02 130
  57 1.84 18
  58 4.94 49
  72 1.61 16
  73 10.8 108
  82 4.96 50
  85 5.15 52
  99 9.01 90
  100 3.42 34