ACCESSION: MSBNK-Fac_Eng_Univ_Tokyo-JP004969
RECORD_TITLE: N,N-DIETHYLBENZAMIDE; EI-B; MS
DATE: 2016.01.19 (Created 2008.10.21, modified 2011.05.06)
AUTHORS: MASS SPECTROSCOPY SOC. OF JAPAN (MSSJ)
LICENSE: CC BY-NC-SA

CH$NAME: N,N-DIETHYLBENZAMIDE
CH$COMPOUND_CLASS: N/A
CH$FORMULA: C11H15NO
CH$EXACT_MASS: 177.11536
CH$SMILES: CCN(CC)C(=O)c(c1)cccc1
CH$IUPAC: InChI=1S/C11H15NO/c1-3-12(4-2)11(13)10-8-6-5-7-9-10/h5-9H,3-4H2,1-2H3
CH$LINK: INCHIKEY JLNGEXDJAQASHD-UHFFFAOYSA-N
CH$LINK: COMPTOX DTXSID0051784

AC$INSTRUMENT: JEOL JMS-D-3000
AC$INSTRUMENT_TYPE: EI-B
AC$MASS_SPECTROMETRY: MS_TYPE MS
AC$MASS_SPECTROMETRY: ION_MODE POSITIVE
AC$MASS_SPECTROMETRY: IONIZATION_ENERGY 70 eV

MS$FOCUSED_ION: ION_TYPE [M]+*

PK$SPLASH: splash10-0a6r-3900000000-c2ac50229b0f5be1728e
PK$NUM_PEAK: 15
PK$PEAK: m/z int. rel.int.
  51 3.49 35
  52 12.31 123
  53 1.04 10
  56 2.08 21
  72 1.26 13
  76 2.01 20
  77 39.86 399
  78 3.41 34
  105 99.99 999
  106 8.22 82
  134 2.28 23
  148 3.31 33
  176 20.38 204
  177 14.72 147
  178 1.71 17