ACCESSION: MSBNK-Fac_Eng_Univ_Tokyo-JP005006
RECORD_TITLE: (29H,31H-PHTHALOCYANINATO(2-)-N(29),N(30),N(31),N(32))COPPER; EI-B; MS
DATE: 2016.01.19 (Created 2008.10.21, modified 2011.05.06)
AUTHORS: ISA K, FUKUI UNIV.
LICENSE: CC BY-NC-SA

CH$NAME: (29H,31H-PHTHALOCYANINATO(2-)-N(29),N(30),N(31),N(32))COPPER
CH$NAME: PHTHALOCYANINE BLUE
CH$COMPOUND_CLASS: N/A
CH$FORMULA: C32H16CuN8
CH$EXACT_MASS: 575.07939
CH$SMILES: N/A
CH$IUPAC: N/A
CH$LINK: CAS 147-14-8

AC$INSTRUMENT: JEOL JMS-01-SG
AC$INSTRUMENT_TYPE: EI-B
AC$MASS_SPECTROMETRY: MS_TYPE MS
AC$MASS_SPECTROMETRY: ION_MODE POSITIVE
AC$MASS_SPECTROMETRY: IONIZATION_ENERGY 15 eV

MS$FOCUSED_ION: ION_TYPE [M]+*

PK$SPLASH: splash10-004i-0000090000-1a0bfe204930d45dd874
PK$NUM_PEAK: 13
PK$PEAK: m/z int. rel.int.
  128 1 10
  191 17 170
  192 3 30
  193 8 80
  194 2 20
  287.5 4 40
  288.5 1 10
  575 99.99 999
  577 38 380
  578 60 600
  579 33 330
  580 47 470
  581 16 160