ACCESSION: MSBNK-Fac_Eng_Univ_Tokyo-JP005232
RECORD_TITLE: 1(2H)-METHYLENE-(4BETA)-VINYL-3,4,(4ABETA),5,8,(8AALPHA)-HEXAHYDRONAPHTHALENE-6(7H)-ONE ETHYLENE ACETAL; EI-B; MS
DATE: 2016.01.19 (Created 2008.10.21, modified 2011.05.06)
AUTHORS: HISAHIRO HAGIWARA, CHEMICAL RESEARCH INSTITUTE OF NON-AQUEOUSSOLUTIONS TOHOKU UNIV.
LICENSE: CC BY-NC-SA

CH$NAME: 1(2H)-METHYLENE-(4BETA)-VINYL-3,4,(4ABETA),5,8,(8AALPHA)-HEXAHYDRONAPHTHALENE-6(7H)-ONE ETHYLENE ACETAL
CH$COMPOUND_CLASS: N/A
CH$FORMULA: C15H22O2
CH$EXACT_MASS: 234.16198
CH$SMILES: N/A
CH$IUPAC: N/A

AC$INSTRUMENT: JEOL JMS-DX-300
AC$INSTRUMENT_TYPE: EI-B
AC$MASS_SPECTROMETRY: MS_TYPE MS
AC$MASS_SPECTROMETRY: ION_MODE POSITIVE
AC$MASS_SPECTROMETRY: IONIZATION_ENERGY 70 eV

MS$FOCUSED_ION: ION_TYPE [M]+*

PK$SPLASH: splash10-000t-9100000000-477a811d4a5f2ac7527d
PK$NUM_PEAK: 33
PK$PEAK: m/z int. rel.int.
  32 63.3 633
  39 4.2 42
  40 5.3 53
  41 0.72 7
  42 6.6 66
  43 3.8 38
  44 5 50
  53 0.35 4
  55 13.4 134
  65 2.6 26
  67 3.9 39
  73 0.27 3
  77 5.7 57
  79 7.4 74
  80 2.4 24
  86 0.22 2
  87 3.3 33
  91 7.2 72
  93 2.6 26
  99 99.99 999
  100 6.8 68
  105 3.6 36
  107 3.7 37
  112 0.38 4
  120 2.3 23
  151 13.1 131
  152 3.9 39
  178 1.43 14
  179 2.5 25
  180 4.2 42
  206 2.8 28
  234 0.13 1
  235 2.4 24