ACCESSION: MSBNK-Fac_Eng_Univ_Tokyo-JP005289
RECORD_TITLE: ETHYL BROMIDE; EI-B; MS
DATE: 2016.01.19 (Created 2008.10.21, modified 2011.05.06)
AUTHORS: YAMAMOTO M, DEP. CHEMISTRY, FAC. SCIENCE, NARA WOMEN'S UNIV.
LICENSE: CC BY-NC-SA

CH$NAME: ETHYL BROMIDE
CH$COMPOUND_CLASS: N/A
CH$FORMULA: C2H5Br
CH$EXACT_MASS: 107.95746
CH$SMILES: CCBr
CH$IUPAC: InChI=1S/C2H5Br/c1-2-3/h2H2,1H3
CH$LINK: INCHIKEY RDHPKYGYEGBMSE-UHFFFAOYSA-N
CH$LINK: COMPTOX DTXSID6020199

AC$INSTRUMENT: HITACHI RMU-6M
AC$INSTRUMENT_TYPE: EI-B
AC$MASS_SPECTROMETRY: MS_TYPE MS
AC$MASS_SPECTROMETRY: ION_MODE POSITIVE
AC$MASS_SPECTROMETRY: IONIZATION_ENERGY 70 eV

MS$FOCUSED_ION: ION_TYPE [M]+*

PK$SPLASH: splash10-004i-9600000000-37a75d6e9fb6c7febdd9
PK$NUM_PEAK: 21
PK$PEAK: m/z int. rel.int.
  14 1.65 17
  15 1.55 16
  25 3.79 38
  26 24.18 242
  27 80.61 806
  28 20.73 207
  29 99.99 999
  30 2.13 21
  53 1.07 11
  54 1 10
  79 3.78 38
  80 1.55 16
  81 3.69 37
  82 1.65 17
  93 4.27 43
  95 3.4 34
  107 1.36 14
  108 86.93 869
  109 2.91 29
  110 84.72 847
  111 2.04 20