ACCESSION: MSBNK-Fac_Eng_Univ_Tokyo-JP005410
RECORD_TITLE: 1,2-BIS(2-CHLOROETHOXY)ETHANE; EI-B; MS
DATE: 2016.01.19 (Created 2008.10.21, modified 2011.05.06)
AUTHORS: TAJIMA S, GUNMA COLLEGE OF TECHNOLOGY
LICENSE: CC BY-NC-SA

CH$NAME: 1,2-BIS(2-CHLOROETHOXY)ETHANE
CH$COMPOUND_CLASS: N/A
CH$FORMULA: C6H12Cl2O2
CH$EXACT_MASS: 186.02144
CH$SMILES: ClCCOCCOCCCl
CH$IUPAC: InChI=1S/C6H12Cl2O2/c7-1-3-9-5-6-10-4-2-8/h1-6H2
CH$LINK: INCHIKEY AGYUOJIYYGGHKV-UHFFFAOYSA-N
CH$LINK: COMPTOX DTXSID8047000

AC$INSTRUMENT: HITACHI RMU-7M
AC$INSTRUMENT_TYPE: EI-B
AC$MASS_SPECTROMETRY: MS_TYPE MS
AC$MASS_SPECTROMETRY: ION_MODE POSITIVE
AC$MASS_SPECTROMETRY: IONIZATION_ENERGY 70 eV

MS$FOCUSED_ION: ION_TYPE [M]+*

PK$SPLASH: splash10-03dl-9100000000-50807c462c5efa9e298a
PK$NUM_PEAK: 27
PK$PEAK: m/z int. rel.int.
  15 2.52 25
  27 32.53 325
  28 2.86 29
  29 3.93 39
  31 7.85 79
  43 17.22 172
  44 3.76 38
  45 24.57 246
  49 2.36 24
  59 9.03 90
  62 3.42 34
  63 99.99 999
  64 3.31 33
  65 31.63 316
  72 2.47 25
  73 9.48 95
  93 49.86 499
  94 1.68 17
  95 16.04 160
  101 1.29 13
  106 11.72 117
  107 24.73 247
  108 4.88 49
  109 8.02 80
  115 1 10
  137 4.6 46
  139 1.63 16