ACCESSION: MSBNK-Fac_Eng_Univ_Tokyo-JP005448
RECORD_TITLE: (1R*,2R*)-1-(P-METHOXYPHENYL)-2-(1-PYRROLIDINYL)BUTANOL; EI-B; MS
DATE: 2016.01.19 (Created 2008.10.21, modified 2011.05.06)
AUTHORS: HIRAMA M, TOHOKU UNIV. FACULTY OF SCIENCE DEPT. OF CHEMISTRY YUKIBUNSEKI
LICENSE: CC BY-NC-SA

CH$NAME: (1R*,2R*)-1-(P-METHOXYPHENYL)-2-(1-PYRROLIDINYL)BUTANOL
CH$COMPOUND_CLASS: N/A
CH$FORMULA: C15H23NO2
CH$EXACT_MASS: 249.17288
CH$SMILES: N/A
CH$IUPAC: N/A

AC$INSTRUMENT: HITACHI M-52
AC$INSTRUMENT_TYPE: EI-B
AC$MASS_SPECTROMETRY: MS_TYPE MS
AC$MASS_SPECTROMETRY: ION_MODE POSITIVE
AC$MASS_SPECTROMETRY: IONIZATION_ENERGY 14 eV

MS$FOCUSED_ION: ION_TYPE [M]+*

PK$SPLASH: splash10-03di-0900000000-104aba4381fa9db4bd6c
PK$NUM_PEAK: 9
PK$PEAK: m/z int. rel.int.
  96 1.01 10
  110 1.6 16
  111 19.16 192
  112 99.99 999
  113 7.19 72
  135 1.61 16
  136 3.26 33
  231 1.29 13
  249 0.05 1