ACCESSION: MSBNK-Fac_Eng_Univ_Tokyo-JP005512
RECORD_TITLE: (2S)-2-(4-AZIDO-1-OXOBUTYL)-N-TERT-BUTOXYCARBONYLPYRROLIDINE; EI-B; MS
DATE: 2016.01.19 (Created 2008.10.21, modified 2011.05.06)
AUTHORS: HIRAMA M, TOHOKU UNIV. FACULTY OF SCIENCE DEPT. OF CHEMISTRY YUKIBUNSEKI
LICENSE: CC BY-NC-SA

CH$NAME: (2S)-2-(4-AZIDO-1-OXOBUTYL)-N-TERT-BUTOXYCARBONYLPYRROLIDINE
CH$COMPOUND_CLASS: N/A
CH$FORMULA: C13H22N4O3
CH$EXACT_MASS: 282.16919
CH$SMILES: N/A
CH$IUPAC: N/A

AC$INSTRUMENT: HITACHI M-52
AC$INSTRUMENT_TYPE: EI-B
AC$MASS_SPECTROMETRY: MS_TYPE MS
AC$MASS_SPECTROMETRY: ION_MODE POSITIVE
AC$MASS_SPECTROMETRY: IONIZATION_ENERGY 14 eV

MS$FOCUSED_ION: ION_TYPE [M]+*

PK$SPLASH: splash10-0229-0900000000-c59d1f1d7837631cae49
PK$NUM_PEAK: 3
PK$PEAK: m/z int. rel.int.
  70 5.88 59
  114 99.95 1000
  170 99.99 999