ACCESSION: MSBNK-Fac_Eng_Univ_Tokyo-JP005664
RECORD_TITLE: N,N-DIETHYLANILINE; EI-B; MS
DATE: 2016.01.19 (Created 2008.10.21, modified 2011.05.06)
AUTHORS: HASHIMOTO K, KYOTO COLLEGE OF PHARMACY
LICENSE: CC BY-NC-SA

CH$NAME: N,N-DIETHYLANILINE
CH$COMPOUND_CLASS: N/A
CH$FORMULA: C10H15N
CH$EXACT_MASS: 149.12045
CH$SMILES: CCN(CC)c(c1)cccc1
CH$IUPAC: InChI=1S/C10H15N/c1-3-11(4-2)10-8-6-5-7-9-10/h5-9H,3-4H2,1-2H3
CH$LINK: INCHIKEY GGSUCNLOZRCGPQ-UHFFFAOYSA-N
CH$LINK: COMPTOX DTXSID8021800

AC$INSTRUMENT: HITACHI M-80
AC$INSTRUMENT_TYPE: EI-B
AC$MASS_SPECTROMETRY: MS_TYPE MS
AC$MASS_SPECTROMETRY: ION_MODE POSITIVE
AC$MASS_SPECTROMETRY: IONIZATION_ENERGY 20 eV

MS$FOCUSED_ION: ION_TYPE [M]+*

PK$SPLASH: splash10-001i-2900000000-81272445e7dbbc793b2a
PK$NUM_PEAK: 26
PK$PEAK: m/z int. rel.int.
  39 4.65 47
  41 1.82 18
  42 2.2 22
  51 6.88 69
  52 1.39 14
  63 1.14 11
  64 1.32 13
  65 2.91 29
  77 21.28 213
  78 3.32 33
  79 4.85 49
  91 4.72 47
  92 1.36 14
  103 1.21 12
  104 6.18 62
  105 2.26 23
  106 33.8 338
  117 1.09 11
  118 2.54 25
  119 1.73 17
  120 6.52 65
  134 99.99 999
  135 9.06 91
  148 2.62 26
  149 32.88 329
  150 3.7 37