ACCESSION: MSBNK-Fac_Eng_Univ_Tokyo-JP005899
RECORD_TITLE: ETHYL PROPIONATE; EI-B; MS
DATE: 2016.01.19 (Created 2008.10.21, modified 2011.05.06)
AUTHORS: YAMAMOTO M, DEP. CHEMISTRY, FAC. SCIENCE, NARA WOMEN'S UNIV.
LICENSE: CC BY-NC-SA

CH$NAME: ETHYL PROPIONATE
CH$COMPOUND_CLASS: N/A
CH$FORMULA: C5H10O2
CH$EXACT_MASS: 102.06808
CH$SMILES: CCOC(=O)CC
CH$IUPAC: InChI=1S/C5H10O2/c1-3-5(6)7-4-2/h3-4H2,1-2H3
CH$LINK: INCHIKEY FKRCODPIKNYEAC-UHFFFAOYSA-N
CH$LINK: COMPTOX DTXSID1040110

AC$INSTRUMENT: HITACHI RMU-6M
AC$INSTRUMENT_TYPE: EI-B
AC$MASS_SPECTROMETRY: MS_TYPE MS
AC$MASS_SPECTROMETRY: ION_MODE POSITIVE
AC$MASS_SPECTROMETRY: IONIZATION_ENERGY 20 eV

MS$FOCUSED_ION: ION_TYPE [M]+*

PK$SPLASH: splash10-0a6r-9000000000-83da16d7f065f5a57095
PK$NUM_PEAK: 18
PK$PEAK: m/z int. rel.int.
  27 2.86 29
  28 9.59 96
  29 74.29 743
  30 2.45 25
  31 1.84 18
  43 4.9 49
  45 12.86 129
  56 3.47 35
  57 99.99 999
  58 3.88 39
  59 0.82 8
  73 7.55 76
  74 13.88 139
  75 16.73 167
  84 1.84 18
  87 2.45 25
  102 19.39 194
  103 1.22 12