ACCESSION: MSBNK-Fac_Eng_Univ_Tokyo-JP006018
RECORD_TITLE: 1,1,2,2-TETRAMETHYLDISILANE; EI-B; MS
DATE: 2016.01.19 (Created 2008.10.21, modified 2011.05.06)
AUTHORS: YAMAMOTO M, DEP. CHEMISTRY, FAC. SCIENCE, NARA WOMEN'S UNIV.
LICENSE: CC BY-NC-SA

CH$NAME: 1,1,2,2-TETRAMETHYLDISILANE
CH$COMPOUND_CLASS: N/A
CH$FORMULA: C4H14Si2
CH$EXACT_MASS: 118.06340
CH$SMILES: C[SiH](C)[SiH](C)C
CH$IUPAC: InChI=1S/C4H14Si2/c1-5(2)6(3)4/h5-6H,1-4H3
CH$LINK: INCHIKEY RDWAGGBALVFUHB-UHFFFAOYSA-N
CH$LINK: COMPTOX DTXSID40883591

AC$INSTRUMENT: HITACHI RMU-6M
AC$INSTRUMENT_TYPE: EI-B
AC$MASS_SPECTROMETRY: MS_TYPE MS
AC$MASS_SPECTROMETRY: ION_MODE POSITIVE
AC$MASS_SPECTROMETRY: IONIZATION_ENERGY 70 eV

MS$FOCUSED_ION: ION_TYPE [M]+*

PK$SPLASH: splash10-0a4i-9200000000-0f190f7207b81a759394
PK$NUM_PEAK: 57
PK$PEAK: m/z int. rel.int.
  26 0.5 5
  27 0.6 6
  28 3.3 33
  29 0.46 5
  31 11.1 111
  32 1.1 11
  37 0.5 5
  38 0.08 1
  39 1.9 19
  41 0.6 6
  42 3.1 31
  43 4.06 41
  44 5.8 58
  45 9.2 92
  46 0.7 7
  50 0.2 2
  51 2.9 29
  52 2.7 27
  53 2.2 22
  55 0.23 2
  56 0.5 5
  57 2.9 29
  58 60.5 605
  59 99.99 999
  60 8.8 88
  61 3.4 34
  63 0.6 6
  69 0.52 5
  70 1.8 18
  71 2.2 22
  72 1.3 13
  73 8.59 86
  74 7.3 73
  75 3.3 33
  76 0.8 8
  77 0.27 3
  78 17 170
  79 1.2 12
  81 1.3 13
  83 0.12 1
  84 0.8 8
  85 3.7 37
  86 1.3 13
  87 0.27 3
  99 1.5 15
  100 1.2 12
  101 6.7 67
  102 1.38 14
  103 27.7 277
  104 4.3 43
  105 2.1 21
  115 0.06 1
  116 0.9 9
  117 8 80
  118 32.5 325
  119 0.52 5
  120 2.3 23