ACCESSION: MSBNK-Fac_Eng_Univ_Tokyo-JP006359
RECORD_TITLE: 1(2H)-METHYLENE-6(7H)-OXO-4-VINYL-3,4,4ABETA,5,8,8AALPHA-HEXAHYDRONAPHTHALENE; EI-B; MS
DATE: 2016.01.19 (Created 2008.10.21, modified 2011.05.06)
AUTHORS: HISAHIRO HAGIWARA, CHEMICAL RESEARCH INSTITUTE OF NON-AQUEOUSSOLUTIONS TOHOKU UNIV.
LICENSE: CC BY-NC-SA

CH$NAME: 1(2H)-METHYLENE-6(7H)-OXO-4-VINYL-3,4,4ABETA,5,8,8AALPHA-HEXAHYDRONAPHTHALENE
CH$COMPOUND_CLASS: N/A
CH$FORMULA: C13H18O
CH$EXACT_MASS: 190.13577
CH$SMILES: N/A
CH$IUPAC: N/A

AC$INSTRUMENT: JEOL JMS-DX-300
AC$INSTRUMENT_TYPE: EI-B
AC$MASS_SPECTROMETRY: MS_TYPE MS
AC$MASS_SPECTROMETRY: ION_MODE POSITIVE
AC$MASS_SPECTROMETRY: IONIZATION_ENERGY 70 eV

MS$FOCUSED_ION: ION_TYPE [M]+*

PK$SPLASH: splash10-002f-9600000000-b39d4260dde024d3fb68
PK$NUM_PEAK: 55
PK$PEAK: m/z int. rel.int.
  27 17.3 173
  39 26.62 266
  41 41.66 417
  51 7.04 70
  52 5.43 54
  53 20.39 204
  54 12.61 126
  55 47.15 472
  65 15.5 155
  66 10.49 105
  67 27.72 277
  68 7.85 79
  77 31.38 314
  78 12.53 125
  79 99.99 999
  80 60.78 608
  81 38.74 387
  82 5.92 59
  83 6.7 67
  91 4.94 49
  92 19.37 194
  93 57.9 579
  94 51.24 512
  95 16.41 164
  96 7.4 74
  104 6 60
  105 29.15 292
  106 18.51 185
  107 24.88 249
  108 24.69 247
  109 5.5 55
  110 16.51 165
  117 11.31 113
  118 5.95 60
  119 20.82 208
  120 26.64 266
  121 10.17 102
  122 5.66 57
  131 5.75 58
  132 18.91 189
  133 21.75 218
  134 13.21 132
  135 10.95 110
  136 5.01 50
  137 5.04 50
  147 11.75 118
  148 17.64 176
  149 5.38 54
  161 16.42 164
  162 41.12 411
  163 5.22 52
  172 6.86 69
  175 5.09 51
  190 53.1 531
  191 8.35 84