ACCESSION: MSBNK-Fac_Eng_Univ_Tokyo-JP006367
RECORD_TITLE: (-)-MENTHYL ACRYLATE; EI-B; MS
DATE: 2016.01.19 (Created 2008.10.21, modified 2011.05.06)
AUTHORS: HISAHIRO HAGIWARA, CHEMICAL RESEARCH INSTITUTE OF NON-AQUEOUSSOLUTIONS TOHOKU UNIV.
LICENSE: CC BY-NC-SA

CH$NAME: (-)-MENTHYL ACRYLATE
CH$COMPOUND_CLASS: N/A
CH$FORMULA: C13H22O2
CH$EXACT_MASS: 210.16198
CH$SMILES: C=CC(=O)OC([H])(C1)C([H])(C(C)C)CCC([H])(C)1
CH$IUPAC: InChI=1S/C13H22O2/c1-5-13(14)15-12-8-10(4)6-7-11(12)9(2)3/h5,9-12H,1,6-8H2,2-4H3/t10-,11+,12-/m1/s1
CH$LINK: INCHIKEY XJBRSZAYOKVFRH-GRYCIOLGSA-N

AC$INSTRUMENT: JEOL JMS-DX-300
AC$INSTRUMENT_TYPE: EI-B
AC$MASS_SPECTROMETRY: MS_TYPE MS
AC$MASS_SPECTROMETRY: ION_MODE POSITIVE
AC$MASS_SPECTROMETRY: IONIZATION_ENERGY 70 eV

MS$FOCUSED_ION: ION_TYPE [M]+*

PK$SPLASH: splash10-053b-9200000000-c92f03dafff5b8946333
PK$NUM_PEAK: 43
PK$PEAK: m/z int. rel.int.
  32 19.78 198
  39 5.32 53
  40 1.94 19
  41 21.47 215
  42 2.5 25
  43 19.59 196
  44 1.35 14
  53 3.36 34
  54 3.43 34
  55 89.84 898
  56 6.55 66
  57 10.27 103
  58 4.88 49
  65 1.05 11
  67 17.13 171
  68 7.54 75
  69 19.4 194
  70 3.7 37
  71 3.54 35
  73 1.53 15
  77 1.48 15
  79 4 40
  80 8.4 84
  81 66.22 662
  82 32.16 322
  83 13.12 131
  84 2.04 20
  93 1.83 18
  94 11.6 116
  95 99.99 999
  96 27.81 278
  97 5.69 57
  98 1.2 12
  109 9.98 100
  110 5.48 55
  111 2.37 24
  123 38.87 389
  124 4.24 42
  125 2.49 25
  137 3.77 38
  138 85.25 853
  139 9.89 99
  167 1.08 11