ACCESSION: MSBNK-Fac_Eng_Univ_Tokyo-JP006715
RECORD_TITLE: N-(4-HYDROXYPHENYLACETYL)PIPERIDIN-2-ONE; EI-B; MS
DATE: 2016.01.19 (Created 2008.10.21, modified 2011.05.06)
AUTHORS: MASS SPECTROSCOPY SOC. OF JAPAN (MSSJ)
LICENSE: CC BY-NC-SA

CH$NAME: N-(4-HYDROXYPHENYLACETYL)PIPERIDIN-2-ONE
CH$COMPOUND_CLASS: N/A
CH$FORMULA: C13H15NO3
CH$EXACT_MASS: 233.10519
CH$SMILES: Oc(c2)ccc(c2)CC(=O)N(C1)C(=O)CCC1
CH$IUPAC: InChI=1S/C13H15NO3/c15-11-6-4-10(5-7-11)9-13(17)14-8-2-1-3-12(14)16/h4-7,15H,1-3,8-9H2
CH$LINK: INCHIKEY HBHVGNOAVIEGFS-UHFFFAOYSA-N

AC$INSTRUMENT: HITACHI RMU-6G
AC$INSTRUMENT_TYPE: EI-B
AC$MASS_SPECTROMETRY: MS_TYPE MS
AC$MASS_SPECTROMETRY: ION_MODE POSITIVE
AC$MASS_SPECTROMETRY: IONIZATION_ENERGY 20 eV

MS$FOCUSED_ION: ION_TYPE [M]+*

PK$SPLASH: splash10-001i-1900000000-dee9b8bf41f9c1c0e6ad
PK$NUM_PEAK: 30
PK$PEAK: m/z int. rel.int.
  41 1 10
  43 1.5 15
  55 5 50
  56 3 30
  57 2 20
  69 1 10
  70 1 10
  71 1.5 15
  77 1 10
  78 2 20
  79 1 10
  81 1 10
  82 2 20
  83 1 10
  84 1 10
  85 1 10
  98 2 20
  99 2 20
  100 21 210
  101 1.5 15
  106 20 200
  107 12 120
  108 1.5 15
  133 1 10
  134 99.99 999
  135 10 100
  136 1 10
  149 1.5 15
  233 7 70
  234 1.3 13