ACCESSION: MSBNK-Fac_Eng_Univ_Tokyo-JP006716
RECORD_TITLE: N-(3-PHENYLPROPIONYL)PIPERIDIN-2-ONE; EI-B; MS
DATE: 2016.01.19 (Created 2008.10.21, modified 2011.05.06)
AUTHORS: MASS SPECTROSCOPY SOC. OF JAPAN (MSSJ)
LICENSE: CC BY-NC-SA

CH$NAME: N-(3-PHENYLPROPIONYL)PIPERIDIN-2-ONE
CH$COMPOUND_CLASS: N/A
CH$FORMULA: C14H17NO2
CH$EXACT_MASS: 231.12593
CH$SMILES: O=C(C2)N(CCC2)C(=O)CCc(c1)cccc1
CH$IUPAC: InChI=1S/C14H17NO2/c16-13-8-4-5-11-15(13)14(17)10-9-12-6-2-1-3-7-12/h1-3,6-7H,4-5,8-11H2
CH$LINK: INCHIKEY ZVNUABIDENQZES-UHFFFAOYSA-N

AC$INSTRUMENT: HITACHI RMU-6G
AC$INSTRUMENT_TYPE: EI-B
AC$MASS_SPECTROMETRY: MS_TYPE MS
AC$MASS_SPECTROMETRY: ION_MODE POSITIVE
AC$MASS_SPECTROMETRY: IONIZATION_ENERGY 20 eV

MS$FOCUSED_ION: ION_TYPE [M]+*

PK$SPLASH: splash10-0udi-3900000000-c128750417e99f9d0c46
PK$NUM_PEAK: 31
PK$PEAK: m/z int. rel.int.
  41 4 40
  42 3 30
  43 7 70
  44 4 40
  55 5 50
  56 3 30
  78 4 40
  82 2 20
  84 3 30
  91 24 240
  92 3 30
  93 2 20
  98 8 80
  99 18 180
  100 99.99 999
  101 8 80
  102 3 30
  103 2 20
  104 44 440
  105 17 170
  106 3 30
  112 12 120
  113 3 30
  131 5 50
  132 3 30
  133 2 20
  134 1 10
  150 1 10
  231 13 130
  232 4 40
  233 1 10