ACCESSION: MSBNK-Fac_Eng_Univ_Tokyo-JP006735
RECORD_TITLE: N-(2,2-DIDEUTERO-4-PHENYLBUTYRYL)PIPERIDIN-2-ONE; EI-B; MS
DATE: 2016.01.19 (Created 2008.10.21, modified 2011.05.06)
AUTHORS: MASS SPECTROSCOPY SOC. OF JAPAN (MSSJ)
LICENSE: CC BY-NC-SA

CH$NAME: N-(2,2-DIDEUTERO-4-PHENYLBUTYRYL)PIPERIDIN-2-ONE
CH$COMPOUND_CLASS: N/A
CH$FORMULA: C15H19NO2
CH$EXACT_MASS: 245.14158
CH$SMILES: O=C(C2)N(CCC2)C(=O)C([2H])([2H])CCc(c1)cccc1
CH$IUPAC: InChI=1S/C15H19NO2/c17-14-10-4-5-12-16(14)15(18)11-6-9-13-7-2-1-3-8-13/h1-3,7-8H,4-6,9-12H2/i11D2
CH$LINK: INCHIKEY VWMYFCUYOIXABI-ZWGOZCLVSA-N

AC$INSTRUMENT: HITACHI RMU-6G
AC$INSTRUMENT_TYPE: EI-B
AC$MASS_SPECTROMETRY: MS_TYPE MS
AC$MASS_SPECTROMETRY: ION_MODE POSITIVE
AC$MASS_SPECTROMETRY: IONIZATION_ENERGY 20 eV

MS$FOCUSED_ION: ION_TYPE [M]+*

PK$SPLASH: splash10-0fr6-2900000000-0ca0b623f7b1da69edf1
PK$NUM_PEAK: 44
PK$PEAK: m/z int. rel.int.
  41 2.5 25
  43 2.5 25
  46 2 20
  55 3 30
  56 4 40
  59 3 30
  70 4 40
  71 3 30
  82 1.5 15
  87 2 20
  91 15 150
  92 5.5 55
  93 2 20
  98 10 100
  99 29 290
  100 47 470
  101 26 260
  102 8 80
  103 1 10
  104 23 230
  105 10.5 105
  106 1 10
  107 2 20
  112 2.5 25
  113 1 10
  114 3 30
  115 59 590
  116 4 40
  118 1 10
  119 2.5 25
  120 1 10
  131 1.5 15
  142 2 20
  143 99.99 999
  144 8 80
  145 1 10
  148 2.5 25
  149 5 50
  156 3 30
  166 3 30
  246 0.2 2
  247 7.5 75
  248 2.8 28
  249 0.5 5