ACCESSION: MSBNK-Fac_Eng_Univ_Tokyo-JP007227
RECORD_TITLE: ETHYLENE GLYCOL DIETHYL ETHER; EI-B; MS
DATE: 2016.01.19 (Created 2008.10.21, modified 2011.05.06)
AUTHORS: SODA AROMATIC CO., LTD.
LICENSE: CC BY-NC-SA

CH$NAME: ETHYLENE GLYCOL DIETHYL ETHER
CH$COMPOUND_CLASS: N/A
CH$FORMULA: C6H14O2
CH$EXACT_MASS: 118.09938
CH$SMILES: CCOCCOCC
CH$IUPAC: InChI=1S/C6H14O2/c1-3-7-5-6-8-4-2/h3-6H2,1-2H3
CH$LINK: INCHIKEY LZDKZFUFMNSQCJ-UHFFFAOYSA-N
CH$LINK: COMPTOX DTXSID5025285

AC$INSTRUMENT: HITACHI M-80B
AC$INSTRUMENT_TYPE: EI-B
AC$MASS_SPECTROMETRY: MS_TYPE MS
AC$MASS_SPECTROMETRY: ION_MODE POSITIVE
AC$MASS_SPECTROMETRY: IONIZATION_ENERGY 70 eV

MS$FOCUSED_ION: ION_TYPE [M]+*

PK$SPLASH: splash10-0561-9000000000-c5935820b1c819977449
PK$NUM_PEAK: 25
PK$PEAK: m/z int. rel.int.
  15 3.38 34
  19 1.4 14
  26 2.77 28
  27 26.31 263
  28 9.39 94
  29 45.81 458
  30 1.67 17
  31 99.99 999
  41 5.19 52
  42 1.9 19
  43 16.94 169
  44 10.84 108
  45 56.77 568
  46 1.35 14
  47 3.52 35
  51 1 10
  58 1.22 12
  59 97.67 977
  60 2.66 27
  61 2.43 24
  72 3.19 32
  73 6.95 70
  74 43.55 436
  75 2.09 21
  118 1.8 18