ACCESSION: MSBNK-Fac_Eng_Univ_Tokyo-JP007312
RECORD_TITLE: DECANE; EI-B; MS
DATE: 2016.01.19 (Created 2008.10.21, modified 2011.05.06)
AUTHORS: YAMAMOTO M, DEP. CHEMISTRY, FAC. SCIENCE, NARA WOMEN'S UNIV.
LICENSE: CC BY-NC-SA

CH$NAME: DECANE
CH$COMPOUND_CLASS: N/A
CH$FORMULA: C10H22
CH$EXACT_MASS: 142.17215
CH$SMILES: CCCCCCCCCC
CH$IUPAC: InChI=1S/C10H22/c1-3-5-7-9-10-8-6-4-2/h3-10H2,1-2H3
CH$LINK: CAS 124-18-5
CH$LINK: INCHIKEY DIOQZVSQGTUSAI-UHFFFAOYSA-N
CH$LINK: COMPTOX DTXSID6024913

AC$INSTRUMENT: HITACHI RMU-6M
AC$INSTRUMENT_TYPE: EI-B
AC$MASS_SPECTROMETRY: MS_TYPE MS
AC$MASS_SPECTROMETRY: ION_MODE POSITIVE
AC$MASS_SPECTROMETRY: IONIZATION_ENERGY 70 eV

MS$FOCUSED_ION: ION_TYPE [M]+*

PK$SPLASH: splash10-052f-9000000000-17ab8ba53e53f7df1609
PK$NUM_PEAK: 28
PK$PEAK: m/z int. rel.int.
  27 13.86 139
  28 2.72 27
  29 24.25 243
  39 7.64 76
  40 1.43 14
  41 35.94 359
  42 12.93 129
  43 99.99 999
  44 3.26 33
  53 1.66 17
  54 1.19 12
  55 12.73 127
  56 17.53 175
  57 96.16 962
  58 4.06 41
  69 3.77 38
  70 13.49 135
  71 36.8 368
  72 1.99 20
  84 9.3 93
  85 27.22 272
  86 1.86 19
  98 5.07 51
  99 7.84 78
  112 2.03 20
  113 5.28 53
  142 12.44 124
  143 1.5 15