ACCESSION: MSBNK-Fac_Eng_Univ_Tokyo-JP007320
RECORD_TITLE: 1,2-DIAMINOPROPANE; EI-B; MS
DATE: 2016.01.19 (Created 2008.10.21, modified 2011.05.06)
AUTHORS: YAMAMOTO M, DEP. CHEMISTRY, FAC. SCIENCE, NARA WOMEN'S UNIV.
LICENSE: CC BY-NC-SA

CH$NAME: 1,2-DIAMINOPROPANE
CH$COMPOUND_CLASS: N/A
CH$FORMULA: C3H10N2
CH$EXACT_MASS: 74.08440
CH$SMILES: NCC(C)N
CH$IUPAC: InChI=1S/C3H10N2/c1-3(5)2-4/h3H,2,4-5H2,1H3
CH$LINK: CAS 78-90-0
CH$LINK: INCHIKEY AOHJOMMDDJHIJH-UHFFFAOYSA-N
CH$LINK: COMPTOX DTXSID4021761

AC$INSTRUMENT: HITACHI RMU-6M
AC$INSTRUMENT_TYPE: EI-B
AC$MASS_SPECTROMETRY: MS_TYPE MS
AC$MASS_SPECTROMETRY: ION_MODE POSITIVE
AC$MASS_SPECTROMETRY: IONIZATION_ENERGY 70 eV

MS$FOCUSED_ION: ION_TYPE [M]+*

PK$SPLASH: splash10-0006-9000000000-c21c110ad3799b0d0f50
PK$NUM_PEAK: 15
PK$PEAK: m/z int. rel.int.
  15 2.29 23
  18 16.11 161
  27 2.09 21
  28 7.85 79
  29 1.56 16
  30 23.05 231
  41 2.22 22
  42 6.2 62
  43 2.85 29
  44 99.99 999
  45 2.82 28
  56 2.82 28
  57 1.19 12
  58 1.05 11
  74 1 10