ACCESSION: MSBNK-Fac_Eng_Univ_Tokyo-JP007533
RECORD_TITLE: O-ETHYL O-(4-NITROPHENYL)PHENYLPHOSPHOROTOHIOATE; EI-B; MS
DATE: 2016.01.19 (Created 2008.10.21, modified 2011.05.06)
AUTHORS: KOGA M, UNIV. OF OCCUPATIONAL AND ENVIRONMENTAL HEALTH
LICENSE: CC BY-NC-SA

CH$NAME: O-ETHYL O-(4-NITROPHENYL)PHENYLPHOSPHOROTOHIOATE
CH$NAME: EPN
CH$COMPOUND_CLASS: N/A
CH$FORMULA: C14H14NO4PS
CH$EXACT_MASS: 323.03812
CH$SMILES: N/A
CH$IUPAC: N/A
CH$LINK: CAS 2104-64-5

AC$INSTRUMENT: JEOL JMS-01-SG
AC$INSTRUMENT_TYPE: EI-B
AC$MASS_SPECTROMETRY: MS_TYPE MS
AC$MASS_SPECTROMETRY: ION_MODE POSITIVE
AC$MASS_SPECTROMETRY: IONIZATION_ENERGY 70 eV

MS$FOCUSED_ION: ION_TYPE [M]+*

PK$SPLASH: splash10-000i-3901000000-9b9beb4e09274d054e21
PK$NUM_PEAK: 75
PK$PEAK: m/z int. rel.int.
  45 2.2 22
  47 32.2 322
  50 10.1 101
  51 1.8 18
  52 3.4 34
  53 2.2 22
  62 1.8 18
  63 5.75 58
  64 8.5 85
  65 7.9 79
  66 1.8 18
  69 0.25 3
  74 1.5 15
  75 5 50
  76 7.2 72
  77 5.72 57
  78 18.3 183
  79 2.5 25
  80 2.8 28
  81 0.18 2
  82 1.5 15
  83 1.2 12
  85 1.8 18
  92 0.25 3
  93 5.6 56
  94 1.5 15
  95 3.1 31
  96 0.22 2
  105 1.5 15
  107 7.9 79
  108 7.2 72
  109 2.43 24
  110 32.9 329
  111 2.8 28
  112 1.5 15
  122 0.12 1
  123 7.2 72
  124 2.5 25
  125 15.1 151
  129 0.18 2
  133 1.5 15
  139 18.9 189
  140 12.3 123
  141 9.77 98
  142 7.2 72
  143 1.2 12
  147 1.2 12
  150 0.25 3
  151 1.2 12
  152 1.2 12
  153 3.4 34
  155 1.29 13
  156 2.5 25
  157 23.7 237
  158 23.1 231
  159 1.48 15
  168 1.2 12
  169 14.5 145
  170 1.96 20
  184 1.8 18
  185 99.99 999
  186 10.7 107
  187 0.69 7
  216 1.2 12
  233 1.2 12
  246 1.5 15
  248 0.31 3
  262 8.2 82
  278 7.9 79
  279 1.2 12
  293 1.23 12
  294 2.5 25
  323 42.7 427
  324 6.6 66
  325 2.5 25