ACCESSION: MSBNK-Fac_Eng_Univ_Tokyo-JP007656
RECORD_TITLE: DIETHYL ETHER; EI-B; MS
DATE: 2016.01.19 (Created 2008.10.21, modified 2011.05.06)
AUTHORS: TAJIMA S, GUNMA COLLEGE OF TECHNOLOGY
LICENSE: CC BY-NC-SA

CH$NAME: DIETHYL ETHER
CH$NAME: 1,1'-OXYBISETHANE
CH$COMPOUND_CLASS: N/A
CH$FORMULA: C4H10O
CH$EXACT_MASS: 74.07316
CH$SMILES: CCOCC
CH$IUPAC: InChI=1S/C4H10O/c1-3-5-4-2/h3-4H2,1-2H3
CH$LINK: CAS 60-29-7
CH$LINK: INCHIKEY RTZKZFJDLAIYFH-UHFFFAOYSA-N
CH$LINK: COMPTOX DTXSID3021720

AC$INSTRUMENT: HITACHI RMU-7M
AC$INSTRUMENT_TYPE: EI-B
AC$MASS_SPECTROMETRY: MS_TYPE MS
AC$MASS_SPECTROMETRY: ION_MODE POSITIVE
AC$MASS_SPECTROMETRY: IONIZATION_ENERGY 70 eV

MS$FOCUSED_ION: ION_TYPE [M]+*

PK$SPLASH: splash10-003r-9000000000-539b7fc110138db40d75
PK$NUM_PEAK: 19
PK$PEAK: m/z int. rel.int.
  15 3.1 31
  17 1.17 12
  18 7.24 72
  19 2.41 24
  26 2.27 23
  27 17.92 179
  28 8.2 82
  29 48.24 482
  30 1.38 14
  31 99.99 999
  41 11.65 117
  43 6.62 66
  44 3.79 38
  45 34.94 349
  59 41.76 418
  60 1 10
  73 3.86 39
  74 25.57 256
  75 1.31 13