ACCESSION: MSBNK-Fac_Eng_Univ_Tokyo-JP007661
RECORD_TITLE: 1,2-DIBROMOETHANE; EI-B; MS
DATE: 2016.01.19 (Created 2008.10.21, modified 2011.05.06)
AUTHORS: TAJIMA S, GUNMA COLLEGE OF TECHNOLOGY
LICENSE: CC BY-NC-SA

CH$NAME: 1,2-DIBROMOETHANE
CH$COMPOUND_CLASS: N/A
CH$FORMULA: C2H4Br2
CH$EXACT_MASS: 185.86798
CH$SMILES: BrCCBr
CH$IUPAC: InChI=1S/C2H4Br2/c3-1-2-4/h1-2H2
CH$LINK: CAS 106-93-4
CH$LINK: INCHIKEY PAAZPARNPHGIKF-UHFFFAOYSA-N
CH$LINK: COMPTOX DTXSID3020415

AC$INSTRUMENT: HITACHI RMU-7M
AC$INSTRUMENT_TYPE: EI-B
AC$MASS_SPECTROMETRY: MS_TYPE MS
AC$MASS_SPECTROMETRY: ION_MODE POSITIVE
AC$MASS_SPECTROMETRY: IONIZATION_ENERGY 70 eV

MS$FOCUSED_ION: ION_TYPE [M]+*

PK$SPLASH: splash10-0a6r-5900000000-0f8e5929b65c18ffe174
PK$NUM_PEAK: 18
PK$PEAK: m/z int. rel.int.
  14 1.45 15
  25 3.43 34
  26 21.06 211
  27 85.81 858
  28 14.79 148
  79 2.83 28
  81 2.84 28
  93 3.96 40
  95 3.43 34
  105 2.71 27
  106 3.7 37
  107 99.99 999
  108 4.95 50
  109 94.39 944
  110 2.11 21
  186 1.19 12
  188 2.18 22
  190 1.12 11