ACCESSION: MSBNK-Fac_Eng_Univ_Tokyo-JP007672
RECORD_TITLE: ETHYL VINYL ETHER; EI-B; MS
DATE: 2016.01.19 (Created 2008.10.21, modified 2011.05.06)
AUTHORS: TAJIMA S, GUNMA COLLEGE OF TECHNOLOGY
LICENSE: CC BY-NC-SA

CH$NAME: ETHYL VINYL ETHER
CH$NAME: ETHOXYETHYLENE
CH$COMPOUND_CLASS: N/A
CH$FORMULA: C4H8O
CH$EXACT_MASS: 72.05751
CH$SMILES: CCOC=C
CH$IUPAC: InChI=1S/C4H8O/c1-3-5-4-2/h3H,1,4H2,2H3
CH$LINK: CAS 109-92-2
CH$LINK: INCHIKEY FJKIXWOMBXYWOQ-UHFFFAOYSA-N
CH$LINK: COMPTOX DTXSID3029609

AC$INSTRUMENT: HITACHI RMU-7M
AC$INSTRUMENT_TYPE: EI-B
AC$MASS_SPECTROMETRY: MS_TYPE MS
AC$MASS_SPECTROMETRY: ION_MODE POSITIVE
AC$MASS_SPECTROMETRY: IONIZATION_ENERGY 70 eV

MS$FOCUSED_ION: ION_TYPE [M]+*

PK$SPLASH: splash10-002f-9000000000-55335b759dbb362989c0
PK$NUM_PEAK: 17
PK$PEAK: m/z int. rel.int.
  14 5.24 52
  15 14.97 150
  26 9.53 95
  27 51.83 518
  28 9.16 92
  29 62.46 625
  30 1.88 19
  31 11.15 112
  39 1.47 15
  41 3.72 37
  42 8.48 85
  43 99.99 999
  44 98.9 989
  45 12.62 126
  57 1.99 20
  72 46.28 463
  73 2.09 21