ACCESSION: MSBNK-Fac_Eng_Univ_Tokyo-JP007971
RECORD_TITLE: ETHOSUXIMIDE; EI-B; MS
DATE: 2016.01.19 (Created 2008.10.21, modified 2011.05.06)
AUTHORS: HAMAMATSU UNIV. SCHOOL OF MEDICINE
LICENSE: CC BY-NC-SA

CH$NAME: ETHOSUXIMIDE
CH$NAME: 3-ETHYL-3-METHYL-2,5-PYRROLIDINEDIONE
CH$COMPOUND_CLASS: N/A
CH$FORMULA: C7H11NO2
CH$EXACT_MASS: 141.07898
CH$SMILES: CCC(C)(C1)C(=O)NC(=O)1
CH$IUPAC: InChI=1S/C7H11NO2/c1-3-7(2)4-5(9)8-6(7)10/h3-4H2,1-2H3,(H,8,9,10)
CH$LINK: INCHIKEY HAPOVYFOVVWLRS-UHFFFAOYSA-N
CH$LINK: COMPTOX DTXSID7023019

AC$INSTRUMENT: JEOL JMS-D-300
AC$INSTRUMENT_TYPE: EI-B
AC$MASS_SPECTROMETRY: MS_TYPE MS
AC$MASS_SPECTROMETRY: ION_MODE POSITIVE
AC$MASS_SPECTROMETRY: IONIZATION_ENERGY 70 eV

MS$FOCUSED_ION: ION_TYPE [M]+*

PK$SPLASH: splash10-08mi-9400000000-44583cdc88d3203a4e84
PK$NUM_PEAK: 14
PK$PEAK: m/z int. rel.int.
  52 1.61 16
  54 4.5 45
  55 94.66 947
  56 5.19 52
  67 1.83 18
  68 2.06 21
  69 7.25 73
  70 71.7 717
  71 4.52 45
  85 8.14 81
  98 2.48 25
  113 99.99 999
  114 6.32 63
  141 2.74 27