ACCESSION: MSBNK-Fac_Eng_Univ_Tokyo-JP008349
RECORD_TITLE: STEARYLAMIDE; EI-B; MS
DATE: 2016.01.19 (Created 2008.10.21, modified 2011.05.06)
AUTHORS: UBE SCIENTIFIC ANALYSIS LABORATORY
LICENSE: CC BY-NC-SA

CH$NAME: STEARYLAMIDE
CH$COMPOUND_CLASS: N/A
CH$FORMULA: C18H37NO
CH$EXACT_MASS: 283.28751
CH$SMILES: CCCCCCCCCCCCCCCCCC(N)=O
CH$IUPAC: InChI=1S/C18H37NO/c1-2-3-4-5-6-7-8-9-10-11-12-13-14-15-16-17-18(19)20/h2-17H2,1H3,(H2,19,20)
CH$LINK: INCHIKEY LYRFLYHAGKPMFH-UHFFFAOYSA-N
CH$LINK: COMPTOX DTXSID9027025

AC$INSTRUMENT: HITACHI M-60
AC$INSTRUMENT_TYPE: EI-B
AC$MASS_SPECTROMETRY: MS_TYPE MS
AC$MASS_SPECTROMETRY: ION_MODE POSITIVE
AC$MASS_SPECTROMETRY: IONIZATION_ENERGY 70 eV

MS$FOCUSED_ION: ION_TYPE [M]+*

PK$SPLASH: splash10-0a4i-9000000000-9e0257218bfc5bd50b10
PK$NUM_PEAK: 43
PK$PEAK: m/z int. rel.int.
  27 2.39 24
  29 8.19 82
  39 1.54 15
  41 14.21 142
  42 3.38 34
  43 22.42 224
  44 7.03 70
  54 1.06 11
  55 13.23 132
  56 3.06 31
  57 12.17 122
  58 1.4 14
  59 99.99 999
  60 12.36 124
  61 1.26 13
  67 1.34 13
  69 6.03 60
  70 1.85 19
  71 4.54 45
  72 36.39 364
  73 10.12 101
  74 1.74 17
  81 1.13 11
  83 3.51 35
  84 1.54 15
  85 1.97 20
  86 5.36 54
  87 1.9 19
  97 2.82 28
  98 2.9 29
  100 1.74 17
  101 1.81 18
  111 1.14 11
  114 4.16 42
  115 2.25 23
  128 4.79 48
  129 1.47 15
  142 1.02 10
  170 1.12 11
  184 1.09 11
  240 2.03 20
  283 2.46 25
  284 1.78 18